Home > Cannot Open > Fatal Error C1083: Cannot Open Include File: 'stdio.h': No Such File Or Directory

Fatal Error C1083: Cannot Open Include File: 'stdio.h': No Such File Or Directory


To fix this issue, verify that the correct file name is entered.Certain C Runtime Library headers are located in a subdirectory of the standard include directory. Tags: windows ×232 error ×183 include ×3 Asked: 18 Jul '14, 06:49 Seen: 18,965 times Last updated: 14 Oct '14, 12:01 Don't have Wireshark? Cheers, Bertrand. I am just testing it, but have some problems. weblink

Is privacy compromised when sharing SHA-1 hashed URLs? cl /O2 /EHsc /I"c_src" /I"c:/Program Files/erl6.2/erts-6.2/include" /LD /MD /Fepriv\bcrypt_nif.dll c_src\bcrypt _nif.c c_src\blowfish.c Microsoft (R) C/C++ Optimizing Compiler Version 19.00.23026 for x64 Copyright (C) Microsoft Corporation. In both cases be careful about spaces in the path - if in doubt surround the path double-quotes - for example:   set INCLUDE="C:\My Programs\My Header Files"   Wednesday, October 10, What movie is this?

Fatal Error C1083: Cannot Open Include File: 'stdio.h': No Such File Or Directory

fatal error C1083: Cannot open include file: ‘mysql.h': No such file or directory mysql1.c mysql1.c(2) : fatal error C1083: Cannot open include file: 'mysql.h': No such file or directory At this Wireshark documentation and downloads can be found at the Wireshark website. My question is how do I create the corresponding "configure.win" file for VC++? Contact Us - Wrox - Privacy Statement - Top Powered by vBulletin Copyright ©2000 - 2016, Jelsoft Enterprises Ltd. 2013 John Wiley & Sons, Inc.

Then it was able to compile correctly. You can search your system for windows.h with: dir windows.h /s For me, this returned: c:\Program Files (x86)\Microsoft SDKs\Windows\v7.0A\Include So to fix it, I added it with another /I, so my How can I ask about the "winner" of an ongoing match? Cannot Open Include File Stdio H Visual Studio 2015 Learning resources Microsoft Virtual Academy Channel 9 MSDN Magazine Community Forums Blogs Codeplex Support Self support Programs BizSpark (for startups) Microsoft Imagine (for students) United States (English) Newsletter Privacy & cookies

Best regards and happy holidays. Cl Include Path cl : Command line warning D9024 : unrecognized source file type ‘C:\…\libmysql.dll', object file assumed c:\chris\mysql1> cl /I "C:\Program Files (x86)\Microsoft Visual Studio 10.0\VC\include" /I "C:\Program Files (x86)\MySQL\mysql-5.5.30-win32\include" /I "C:\Program Files The time now is 10:54 PM. All rights reserved.

MyClassC.cxx(1) : fatal error C1083: Cannot open include file: 'Riostream.h': No such file or directory
make[3]: *** [MyClassC.obj] Error 2
make[2]: *** [srcDynlib] Error 2

Please make sure that you are using Erlang / OTP version 17.0 or later and that you have a C compiler installed. Cannot Open Source File Stdio.h Visual Studio 2015 FAQinghere commented Feb 11, 2016 When trying to run tests, after getting everything to run for development, I run into more Comeonin compiling issues... You signed in with another tab or window. This is the first time I've used Microsoft's compiler.

Cl Include Path

Hope this helps. mysqlclient.lib(random.obj) : error LNK2019: unresolved external symbol [email protected] referenced in function ... Fatal Error C1083: Cannot Open Include File: 'stdio.h': No Such File Or Directory Is the result of the general election final on 8th of Nov, 2016? Cl Library Path I want to compile the following program: #include #include #include int _tmain(int argc, _TCHAR* argv[]) { IplImage *img = cvLoadImage("funny-pictures-cat-goes-pew.jpg"); cvNamedWindow("Image:",1); cvShowImage("Image:",img); cvWaitKey(); cvDestroyWindow("Image:"); cvReleaseImage(&img); return 0; }

All rights reserved. /out:libmysql.exe "C:\Program Files (x86)\MySQL\mysql-5.5.30-win32\lib\libmysql.dll" mysql1.obj C:\Program Files (x86)\MySQL\mysql-5.5.30-win32\lib\libmysql.dll : fatal error LNK1107: invalid or corrupt file: cannot read at 0x368 The problem is trying to use the .dll http://outwardsound.com/cannot-open/word-cannot-open-the-file-because-the-file-format-does-not-match-the-file-extension.html Thus, I am attaching "myclassR1.tar.gz" containing two different makefiles, "Makefile.win" and "Makefile.win32" which both work, and an example macro. The C++ compiler has no knowledge of any visual anything - it's just a brand. error C2061: syntax error : identifier ‘SOCKET' This was actually a small slew of simple syntax errors. Fatal Error C1034: No Include Path Set

share|improve this answer answered Dec 22 '10 at 1:05 Ben Voigt 204k21240457 2 That's step 1 in the linked article. Sobieck00 closed this Oct 24, 2015 benjamin79 commented Jan 28, 2016 I had the same error. Installed VS 2015. check over here mysql1.obj : error LNK2019: unresolved external symbol [email protected] referenced in function _main In fact, there were 4 similar altogether: mysql1.obj : error LNK2019: unresolved external symbol [email protected] referenced in function _main

So the above changed to: cl /I "C:\Program Files (x86)\Microsoft Visual Studio 10.0\VC\include" /I "C:\Program Files\MySQL\MySQL Server 5.5\include" mysql1.c 2. Cl.exe Include Path up vote 10 down vote favorite 1 I have installed Microsoft Visual C++ Express Edition, Version 9.0.30729.1 SP. At delivery time, client criticises the lack of some features that weren't written on my quote.

mysql1.exe : fatal error LNK1120: 10 unresolved externals Fix: Switched from static (/MT) compilation to dynamic (/MD) compilation seemed to fix this: So the command was (note "/MT …\mysqlclient.lib" to "/MD

Sign in to comment Contact GitHub API Training Shop Blog About © 2016 GitHub, Inc. Ask a question Quick access Forums home Browse forums users FAQ Search related threads Remove From My Forums Answered by: cl command ,cannot open include file Archived Forums V > Visual For more information about how to use environment variables, see How to: Use Environment Variables in a Build.To fix this issue, correct the path that the compiler uses to search for Error: Cannot Determine The Location Of The Vs Common Tools Folder. Here are the common reasons why the compiler generates this error.The specified file name is wrongThe name of a file may be mistyped.

A dialog will appear. How to react? share|improve this answer answered Sep 18 '10 at 13:06 Puppy 111k19160336 4 Where did you get the idea that cl can only be invoked from within Visual Studio - that this content visual-c++ opencv share|improve this question asked Sep 18 '10 at 12:58 gojira 95631329 add a comment| 2 Answers 2 active oldest votes up vote 10 down vote First of all, be

The command line compiler that comes with it is at Version 15.00.30729.01 for 80x86. Bar to add a line break simply add two spaces to where you would like the new line to be. Join them; it only takes a minute: Sign up cl.exe not finding any standard include file up vote 10 down vote favorite 2 I found this sample code on the msdn Not the answer you're looking for?

This is an alternative to conditional compilation by using preprocessor commands. Please try the two scripts in attachment. I had forgot that while I'm on a 64-bit machine, and have 64-bit MySQL already installed (I'm using that header file in my include path), the VS Express is 32-bit. You may have to modify the path to add a directory for your project.

For example, C++ Copy #include might not find the file you intend. For more information, see /clr (Common Language Runtime Compilation).The file is compiled by using a different /analyze compiler option setting than is used to precompile the headers. (When the headers for There is a Standard C++ Library header file named algorithms that does not have a .h file name extension. I just started my first real job, and have been asked to organize the office party.

comeonin owner riverrun commented Feb 12, 2016 Glad you solved it in the end. I hope to have more concrete information for you in the near future. However, it can occur when large projects are built on a computer that has limited physical memory.The following example generates a C1083 error. This documentation is archived and is not being maintained.

I know for sure that quotes cause it to check the current directory first, but I can't remember if it will search the include paths too. You can recompile this dependency with "mix deps.compile c omeonin", update it with "mix deps.update comeonin" or clean it with "mix deps.clean comeonin" ** (Mix.Error) Could not compile Comeonin.