Home > Cannot Run > Cannot Run Program /bin/java Jenkins

Cannot Run Program /bin/java Jenkins

Contents

I could probably fix this, but, really, >> why should I have to? more stack exchange communities company blog Stack Exchange Inbox Reputation and Badges sign up log in tour help Tour Start here for a quick overview of the site Help Center Detailed Wrong way on a bike lane? Tired of useless tips? check over here

Expression evaluates numerically inside of Plot but not otherwise How can I track time from the command-line? Obs. #1: paths changed, slightly, in order to prevent disclosing confidential information. How can I declare independence from the United States and start my own micro nation? How do I handle this?

Cannot Run Program /bin/java Jenkins

Why isn't it using the java from the jdk install >> I specified in the project config? (1.417) >> >> Started by user anonymous >> Updating http://svn.basistech.net/engineering/rse/trunk>> U       I'll try to set PATH variable better21:31:41 no change for https://murgi.larural.es:800/corebanking/framework/ext-libs/trunk since the previous build 21:31:41 [ext-libs] $ /bin/sh -xe /tmp/hudson4719096548760543199.sh 21:31:41 + java -jar /cis/jenkins/software/analizepom.jar pom.xml CHECK-SNAPSHOT21:31:42 Parsing POMs 21:31:43 How can I take a powerful plot item away from players without frustrating them? Show Operating System: Linux on both master and slave.

Hide Permalink Shay Yaakov added a comment - 31/Oct/13 4:22 PM I couldn't reproduce it on 2.2.0, does it fail for you even without Artifactory? Piske added a comment - 30/Oct/13 5:07 PM The same problem occurs on 2.2.0 as well. Join Now I want to fix my crash I want to help others java.io.IOException: Cannot run program "/home/qaserver3/app/jdk1.6.0_45/bin/java" (in directory "/var/lib/jenkins/jobs/SpringHelloWorld3/workspace"): error=13, Permission denied Stack Overflow | varun | 1 year Java Io Ioexception Cannot Run Program Jenkins Free forum by Nabble Edit this page Jenkins CI › Jenkins users Search everywhere only in this topic Advanced Search Building Maven project in Jenkins ‹ Previous Topic Next Topic ›

If the former, whatever you’re using to launch it doesn’t know where to find a JVM. Java.io.ioexception Error=2 No Such File Or Directory Jenkins Hello Benson, Have you configured a jdk for your job ? 2011/6/23 Benson Margulies <[hidden email]>: > My system has no /bin/java. My first guess is that the slave doesn’t have a path to java in its environment. Certainly not the JDK we set (which the mismatch should ignore) or the default /bin/java (which doesn't exist).

Even something as simple as "No valid JDK installers found. Cannot Run Program Java In Directory How do pilots identify the taxi path to the runway? Piske Votes: 0 Vote for this issue Watchers: 2 Start watching this issue Dates Created: 30/Oct/13 4:34 PM Updated: 01/Nov/13 3:47 PM Resolved: 01/Nov/13 3:47 PM Atlassian JIRA Project Management Software Have to try to clean the workspace for this specific job ?

Java.io.ioexception Error=2 No Such File Or Directory Jenkins

Look for JAVA_HOME. On Thu, Jun 23, 2011 at 12:21 PM, Olivier Lamy <[hidden email]> wrote: > Hello Benson, > Have you configured a jdk for your job ? > > 2011/6/23 Benson Margulies Cannot Run Program /bin/java Jenkins comment:6 Changed 23 months ago by eedri Status changed from assigned to closed Resolution set to worksforme doesn't happen anymore, closing fox now. Jenkins Failed To Parse Poms This could be a nasty bug to people who use that build step and want to control the version of Java on a per-job basis.

comment:3 Changed 2 years ago by dcaro Owner changed from infra@… to dcaro Status changed from new to assigned comment:4 Changed 2 years ago by dcaro And remove maven build steps check my blog My system has no /bin/java. Parsing POMs $ java -Xms256m -Xmx512m -cp /opt/eustfnt3/jenkins/plugins/maven-plugin/WEB-INF/lib/maven31-agent-1.4.jar:/opt/eustfnt3/maven/apache-maven-3.1.0/boot/plexus-classworlds-2.4.2.jar:/opt/eustfnt3/maven/apache-maven-3.1.0/conf/logging jenkins.maven3.agent.Maven31Main /opt/eustfnt3/maven/apache-maven-3.1.0/ /opt/eustfnt3/jenkins/war/WEB-INF/lib/remoting-2.32.jar /opt/eustfnt3/jenkins/plugins/maven-plugin/WEB-INF/lib/maven31-interceptor-1.4.jar /opt/eustfnt3/jenkins/plugins/maven-plugin/WEB-INF/lib/maven3-interceptor-commons-1.4.jar 39028 ERROR: Failed to parse POMs java.io.IOException: Cannot run program "java" (in directory "/opt/eustfnt3/jenkins/jobs/AceCasualtyUWPortal_Release3/workspace/AceCasualtyPortal"): error=13, The file access Does anybody know why jenkisn slave cab give this to me? Java Io Ioexception Cannot Run Program Mvn Error 2 No Such File Or Directory

I could probably fix this, but, really, >> why should I have to? Show Shay Yaakov added a comment - 31/Oct/13 4:22 PM I couldn't reproduce it on 2.2.0, does it fail for you even without Artifactory? Using default JDK settings." would have been a clue. http://outwardsound.com/cannot-run/this-program-cannot-be-run-in-dos-mode.html We do not have a /bin/java since we want to control the version of Java on a per job basis, so adding it is not an option. 00:00:06.627 Parsing POMs 00:00:07.322

Why did Michael Corleone not forgive his brother Fredo? Caused By: Java.io.ioexception: Error=2, No Such File Or Directory Is adding the ‘tbl’ prefix to table names really a problem? This is a usability bug.

If an image is rotated losslessly, why does the file size change?

Caused by: java.lang.IndexOutOfBoundsException: Index: 1997078527, Size: 0 I have tried creating a new build, no luck Building locally works fine All other similar jobs work fine I'm running letest jenkins (1.489) at java.lang.ProcessBuilder.start(ProcessBuilder.java:471) at hudson.Proc$LocalProc.(Proc.java:244) at hudson.Proc$LocalProc.(Proc.java:216) at hudson.Launcher$LocalLauncher.launch(Launcher.java:773) at hudson.Launcher$ProcStarter.start(Launcher.java:353) at hudson.maven.AbstractMavenProcessFactory.newProcess(AbstractMavenProcessFactory.java:238) at hudson.maven.ProcessCache.get(ProcessCache.java:235) at hudson.maven.MavenModuleSetBuild$MavenModuleSetBuildExecution.doRun(MavenModuleSetBuild.java:739) at hudson.model.AbstractBuild$AbstractBuildExecution.run(AbstractBuild.java:562) at hudson.model.Run.execute(Run.java:1665) at hudson.maven.MavenModuleSetBuild.run(MavenModuleSetBuild.java:509) at hudson.model.ResourceController.execute(ResourceController.java:88) at hudson.model.Executor.run(Executor.java:246) Caused by: java.io.IOException: error=13, The immediately by replying to this message and then promptly deleting it and your reply permanently from your computer. Createprocess Error 2 The System Cannot Find The File Specified Java I'm not sure what JDK they were using, though.

COuld you please suggest. Hide Permalink jminne added a comment - 2015/Mar/05 2:27 PM James is correct. If you have received this communication in error, please notify Litle & Co. http://outwardsound.com/cannot-run/program-sh-not-found-in-path-android.html Start the slave via SSH option was impossible.Thank youEl jueves, 5 de julio de 2012 21:37:55 UTC+2, David Mata escribió:Hello.Does anybody know why jenkisn slave cab give this to me?Thank you

A maven 3 build job that it is built on the slave node. stdarg and printf() in C Can I cite email communication in my thesis/paper? If the former, whatever you’re using to launch it doesn’t know where to find a JVM. Cheers Le 16 août 2013 02:20, "inbaraj" <[hidden email]> a écrit : Hello, I created a simple Maven webapp by issuing this command. *mvn archetype:generate -DgroupId=web.myapp -DartifactId=myapp -DarchetypeArtifactId=maven-archetype-webapp -DinteractiveMode=false * and Later

Parsing POMs $ java -Xms256m -Xmx512m -cp /opt/eustfnt3/jenkins/plugins/maven-plugin/WEB-INF/lib/maven31-agent-1.4.jar:/opt/eustfnt3/maven/apache-maven-3.1.0/boot/plexus-classworlds-2.4.2.jar:/opt/eustfnt3/maven/apache-maven-3.1.0/conf/logging jenkins.maven3.agent.Maven31Main /opt/eustfnt3/maven/apache-maven-3.1.0/ /opt/eustfnt3/jenkins/war/WEB-INF/lib/remoting-2.32.jar /opt/eustfnt3/jenkins/plugins/maven-plugin/WEB-INF/lib/maven31-interceptor-1.4.jar /opt/eustfnt3/jenkins/plugins/maven-plugin/WEB-INF/lib/maven3-interceptor-commons-1.4.jar 39028 ERROR: Failed to parse POMs java.io.IOException: Cannot run program "java" (in directory "/opt/eustfnt3/jenkins/jobs/AceCasualtyUWPortal_Release3/workspace/AceCasualtyPortal"): error=13, The file access If you have received this communication in error, please notify Litle & Co. At delivery time, client criticises the lack of some features that weren't written on my quote. Why isn't it using the java from the jdk install I specified in the project config? (1.417) Started by user anonymous Updating http://svn.basistech.net/engineering/rse/trunkU etrog_doc/en/rse-lucene.xml At revision 23765

Take a tour to get the most out of Samebug. mvn archetype:generate -DgroupId=web.myapp -DartifactId=myapp -DarchetypeArtifactId=maven-archetype-webapp -DinteractiveMode=false and Later i try to build this in jenkins. Assign it to me. Link-only answers can become invalid if the linked page changes. –Amit Aug 1 '13 at 6:32 add a comment| up vote 0 down vote Maybe the workspace is corrupted and on

Show Daniel Beck added a comment - 2014/Oct/29 7:35 AM I found this label mismatch was killing Maven jobs and Freeform jobs using the "Invoke Maven 3" Build Task, but Freeform Automated exception search integrated into your IDE Test Samebug Integration for IntelliJ IDEA Root Cause Analysis java.io.IOException error=13, Permission denied at java.lang.UNIXProcess.forkAndExec() Java RT ProcessBuilder.start java.lang.UNIXProcess.forkAndExec(Native Method) java.lang.UNIXProcess.(UNIXProcess.java:135) java.lang.ProcessImpl.start(ProcessImpl.java:130) java.lang.ProcessBuilder.start(ProcessBuilder.java:1021) 715 Command line without the Artifactory plugin off: /tools/jdk/jdk1.6.0_34/bin/java -cp /development/application/build-data/jenkins/maven3-agent.jar:/home/webadmin/tools/apache-maven/boot/plexus-classworlds-2.4.jar org.jvnet.hudson.maven3.agent.Maven3Main /home/webadmin/tools/apache-maven /development2/application/build-data/jenkins/slave.jar /development/application/build-data/jenkins/maven3-interceptor.jar /development/application/build-data/jenkins/maven3-interceptor-commons.jar 44525 Command line, that fails, with the Artifactory plugin on: java -Dm3plugin.lib=/development/application/build-data/jenkins/cache/artifactory-plugin/2.1.8 -Dmaven3.interceptor.common=/development2/application/build-data/jenkins/cache/artifactory-plugin/2.1.8 -cp /development2/application/build-data/jenkins/maven3-agent.jar:/home/webadmin/tools/apache-maven/boot/plexus-classworlds-2.4.jar org.jvnet.hudson.maven3.agent.Maven3Main Build infrastructure: A Jenkins installation with one slave node.

In reply to this post by Olivier Lamy-2 resetting the config of the jdk in system settings fixed this. Try JIRA - bug tracking software for your team.